Skip to main content
Kofax

List of all KCS Event-log entries

Description

This article contains a list of all KCS error codes and KCS event log entries.
The full list with more details can be found in the attached HTML- and Excel-file, at the bottom of this article.

 

10 textstring was too long
100 ok
107 the end of object (or file) has been reached
200 send orders deleted partially
201 texts deleted partially
202 send orders re-routed partially
300 attempt to overwrite an existing object
301 a child of certain type doesn't exist
302 max. entries/envelopes reached
303 too many send orders
304 object is temporarily locked
305 send order(s) not deleted
306 file(s) not deleted
308 max. store capacity reached
309 temporarily no handle available
310 memory full
311 abbreviated number does not exist
312 abbreviated numbers file does not exist
313 text too long
314 Internal: Drive does not exist
315 Internal: Disk Error
316 abbreviated numbers file locked
317 wrong command
318 no message
319 no record
320 loop detected
321 send order(s) not re-routed
322 insufficient user rights
400 bad command syntax
401 bad parameter
402 missing parameter
403 bad reference
404 bad correction mode
405 bad number
406 bad channel
407 bad date
408 bad time
409 bad low value
410 bad high value
411 bad number series
412 bad actual number
414 bad value for last value of number series
415 bad value for file number
416 bad author
417 bad mode
418 (bad break parameter )
419 (bad error code)
420 (bad document- and page-number)
421 bad type
422 (bad END-code)
423 bad stop parameter
424 (bad CTIME)
425 value exceeds the object's range
426 bad termination parameter
427 bad nodes
428 bad originator
429 bad user id
430 bad notpa
431 bad cost centre
432 bad posdu
433 bad send typ
434 bad priority
435 bad notif
436 bad record (= record too long)
500 different object version
501 no object exists for the spec. handle
502 Internal: Truncate with wrong length
600 call of function is not permitted
601 too less memory left to perform operation
602 save attempt to an object w/o parent obj.
603 type does not allow this kind of operation
604 invalid time value
605 invalid sub object specifier
606 invalid number series
607 invalid channel specifier
608 connection to server could not be established
609 invalid user ID
610 wrong password
611 not possible to maintain connection
612 server temporarily busy
613 passive session was cancelled
614 selector object is invalid
615 corrupted entry
616 a receiver entry could not be accepted
617 Originator wrong
618 status change not possible
619 the end of block is reached
620 wrong function for that object type
621 Registration Limit reached
622 illegal ASCII objectformat
623 invalid syntax for path
624 incompatible Program Versions
625 the password has expired
626 folder name too long for local folder
627 the new password is invalid (e.g. equal to old one)
628 wrong password, next invalid attempt will lock account
629 your account has been locked
630 DISC_IND_T received at connect
631 no call confirmation from server
632 the new password is too short
700 session was cancelled
701 stream was cancelled by control frame
702 disconnect for any reason
703 wrong type of stream
704 maximum number of documents on archive volume reached
705 buffer for mail entry too small
706 info record split
707 string too long for word tree
708 error inserting key into word tree
709 info occurrence list record full
710 info already set in occurrence list
711 wrong index in volume table
712 error creating win32 event
713 info incompatible file version
714 error in file access
715 transaction handler blocks maximum number reached
716 info search thread reset
717 no search thread found
718 search result buffer overflow
719 wrong document number
720 CD volume compare failed, files not equal
721 maximum number of volumes reached
722 search stopped for CD writing
723 error with tcrOpen function
724 volume space full
725 archive data base file corrupt
726 error allocating memory
727 archive disk full
728 index volume can't be created
729 corrupt word tree building index volume
730 corrupt occurrence list building index volume
731 internal error opening index volume
732 Error in communication with TCJUKE process
733 TCJUKE process did not complete function within timeout
734 internal error in CD writer thread
735 encrypted copy of volume not found
736 no blank CD or no CD writer accessible
737 CD could not be written without errors
738 the jukebox manager service is not responding
739 jukebox or magazine inactive
740 not enough space on CD
741 generic jukebox access or CD writing error
742 jukebox / CD writer license error
743 file size exceeds 4 GB limit
750 maximum datasize exceeded
751 invalid HTCTI
752 temporarily no SAP available
754 sending queue full
755 line disconnected
756 illegal frame received
757 disconnect indication received
758 disconnect due to line problems
759 call indication received
760 call confirmation received
761 data indication received
762 control data received
770 error during connect
771 error during disconnect
772 server could not be started
800 Range for Fatal errors from server or OHH
801 Max. poss. level of object nesting reached
802 Internal Objectbuffer overrun
803 wrong index into a list
804 wrong index into a list
805 number of sessions wrong
806 CIF internal problem
807 ENV internal
808 ENV internal
850 Range for Fatal OHH errors
851 OHH produced Entry w/o content
852 Wrong Function Code sent to OHL
853 Lock of memory Block failed
854 Container has no Child Slot left
855 OHH produced corrupted stream
888 general fatal errorcode
889 can not initialize stream (tcti,file,..)
1000 0,01
1010 incorrect lenght of pixelline
1011 Corrupted TCI-Block
1012 Overrun error while receiving
1013 Motor was aborted
1014 unable to load TCGTOOL.DLL (for watchdog)
1015 msgIterate: No objects found
1016 There was no image data
1020 Error on opening of input file
1021 Error on opening of output file/device
1022 Error on opening of temporary file
1023 Error not enough free memory
1024 Error no VGA card installed
1025 Error in command line
1026 Error opening com port
1027 Error loading font
1028 Format error
1029 Resolution error wrong for TCI
1030 Scaletopage with wrong size
1031 Invalid argument
1032 msgIterate: possible recursion in TCSI-objects
1033 from_page out of range
1034 Could not convert file %1. The limit of %2 KB of the Problem Directory %3 is reached. No further files are written to this directory.
1100 Perror was called
1101 Postscript DLL cannot be loaded
1102 PCL  DLL cannot be loaded
1103 Postscript: Cannot create tempfile
1104 Lincoln Converter Exception occurred during PCL conversion
1105 Lincoln Converter Exception occurred during PS conversion
1400 0,01
1401 TCMsgWait is starting
1402 TCMsgWait is stopping
1403 connected to TCOSS server %1
1500 The MWA is starting
1501 The MWA started successfully
1502 The MWA is stopping
1503 The MWA stopped
1504 Mailbox %1 cannot be opened
1505 Registry key %1 cannot be opened
1506 MAPI Logon / Exchange Logon failed
1507 The Exchange message store cannot be opened
1508 Connection with message store has been lost
1509 MX Service %1 not answering
1510 Logon to KCS server  failed with error %1 (%2)
1511 Cannot send to %1 (error %2)
1512 No valid license
1513 No mailboxes could be opened. Shutting down.
1701 TCRTF cannot convert the Rich Text Coversheet because there is no TOPCALL Fax printer installed on the system.
1702 Rich Text conversion failed due to Problems with riched20.dll - windows error %1.
1703 The Rich Text conversion module TCRTF.dll  failed to dynamically allocate some memory.
1704 The Rich Text conversion failed due to an internal programming error.
1705 The Rich Text conversion failed to read and analyse the rich text - internal error code: %1. Additional information can be found in the trace file.
1706 The Rich Text conversion failed to produce TCI code - internal error code: %1. Additional information can be found in the trace file.
1707 The Rich Text conversion module TCRTF.dll is regularily shutting down. No more Rich Text conversion functionality will be available.
1708 The Rich Text conversion module TCRTF failed to create a Device Context. Windows reports error code: %1
1709 The Rich Text conversion module TCRTF.dll failed to create a bitmap for rendering. Windows reports error %1.
1800 Error in RFC function %1 (%2): %3
1801 Cannot copy file %1 to %2: error %3
1802 Cannot connect to remote system, RASDial Error %1
1803 Configuration file %1 is missing.
1900 No steps defined
1901 Cannot logon to TCOSS server (%1)
1902 Batch successfully completed
1903 Batch failed at step %1
1904 Successfully started
1905 Stopping
1950 Document %1 was successfully released via release setup %2
1951 Document %1 could not be released via release setup %2 (%3)
1952 Document %1 could not be released (%2)
2000 SE: The system is out of memory or resources
2001 SE: Incorrect function
2002 SE: File not found
2003 SE: Path not found
2004 SE: The system cannot open the file.
2005 SE: Access denied
2008 SE: Out of memory
2011 SE:An attempt was made to load a program with an incorrect format
2026 SE: Sharing violation
2027 SE: The file name association is incomplete or invalid.
2028 SE:The DDE transaction could not be completed because the request timed out.
2029 SE: The DDE transaction failed
2030 SE: The DDE transaction could not be completed because other DDE transactions were being processed.
2031 SE: There is no application associated with the given file name extension.
2032 SE: The specified dynamic-link library was not found.
2034 Cannot convert .exe, bat, com or reg files
2035 Problems with DDE-Server
2036 Timeout waiting for printerdriver
2037 Cannot Install Hook for client Application
2038 unable to copy file
2039 EACCESS cannot remove file (access)
2040 TCDC was aborted while converting this file.
2041 have no memory to record keystrokes
2042 App was killed the hard way!
2043 App terminates before timeout
2044 tcpd_attach to TCDDIMON.DLL fails
2045 error loading TCDDIMON.DLL or its fns
2046 error launching printing application
2047 error stopping printing application
2048 No file associated to document
2049 No 16 - Bit application allowed in background
2050 printing callback returned error
2051 error creating / opening mutex
2052 Ignore files with the extension %1
2053 Unable to duplicate the passed TCSI Object for RTF printing
2054 A document (%1) could not be converted for any reason (macro, layout, ...). TCDC is in  HelpMode.
2055 JFMERGE has failed to print.
2056 Could not convert file %1. It is saved as %2 for further checking
2057 Could not convert file %1. The limit of %2 KB of the Problem Directory %3 is reached. No further files are written to this directory.
2058 Could not convert file %1. The limit of %2 KB of the Helpme Directory %3 is reached. No further files are written to this directory.
2059 Job %1 is not for JFMERGE. Only JFMERGE Jobs are allowed.
2060 Reject files with extension %1.
2061 File is already a pdf file
2062 The printer does not exist
2063 Unhandled Print Jobs found in Print Queue
2064 Failed to read from or write to the registry
2065 Failed to set a new default printer
2066 Failed to print to TIFF/PDF printer
2067 Failed to create a temporary file or filename
2068 Failed to set name of output file for TIFF/PDF printer
2069 Failed to embed TIFF/PDF file into KCS message (TCSI error)
2070 The process %1 has exceeded the timeout of %2 ms to react to a new default printer" notification for the %3. time."
2071 The process %1 has exceeded the timeout of %2 ms to react to a new default printer" notification more often, than the configured tolerance of %3. Therefore it will no longer receive such notifications."
2100 TCDCLINK Error: %1
2101 TCDCLINK Warning: %1
2102 TCDCLINK Information: %1
2103 TCDCLINK Warning: %1;
2501 Riched20.dll could not load rich text from file %1. The rich text stream in operation was aborted after reading %2 characters with internal error code %3. The last reported windows error code is %4.
3000 Admin logon to Exchange via profile %1 failed
3001 MAPI Initialization failed: %1  (%2)
3002 Error allocating %1 bytes
3003 Exception in function %1 (mailbox %2, error %3: %4)
3004 Error accessing mailbox %1
3005 Error sending message (mailbox %1, error %2: %3)
3006 Internal error in function %1 (mailbox %2, error %3: %4)
3015 Error opening the address book: %1
3016 Embedded File Attachment :
3017 Linked File Attachment :
3018 Embedded Message Attachment :
3019 Embedded OLE Attachment :
3020 Attachment :
3100 Not logged in to Exchange
3101 Mailbox logoff failed
3102 Error finding item in contents table
3103 Invalid path format
3104 Error reading properties of a MAPI object
3105 Error query TFC message interface
3106 Error opening MAPI address book
3107 Error creating a new SPI directory object
3108 Invalid parameters passed to interface function
3109 Error creating new MAPI message
3110 Error sending MAPI message via Exchange
3111 No current object selected in directory
3112 Method is not supported with this type of object
3113 Error with MAPI directory seek
3114 Error deleting a message
3115 Error fetching rows from MAPI contents table
3116 Error locating a user's inbox or outbox
3117 Error opening a user's inbox or outbox: %1
3118 Error opening folder contents table
3119 Error setting wanted columns for folder contents table
3120 Error locating Exchange Global Address List
3121 Error opening Exchange Global Address List
3122 Wanted property missing in MAPI object
3123 Error opening object from folder
3124 Error setting read flag of message
3125 TFC error encountered
3126 Error opening attachment table of a MAPI message
3127 Error setting properties in a message or recipient
3128 Error setting recipients of Exchange message
3129 Error creating body of Exchange message
3130 Error creating one-off Entryid for Exchange recipient
3131 Error locating Exchange user via his unique name
3132 Error reading MAPI status table
3133 Error opening an Exchange object via session pointer
3134 Error creating a new SPI session
3135 Error opening a property as IStream
3136 Error creating temporary filename
3137 Error with IStream object
3138 Error reading MAPI property
3199 unknown error
3200 Error initializing Lotus Notes API (%1 - %2)
3201 Error initializing Lotus Notes API thread (%1 - %2)
3202 Error terminating Lotus Notes API thread (%1 - %2)
3203 Error terminating Lotus Notes API (%1 - %2)
3204 Can't login with user %1
3205 Can't open %1 of user %2 on Server %3 with MailFile %4
3206 Can't open %1 for user %2 on Server %3 with Addressbook %4
3501 error while initializing usrio
3502 No name found in user string!
3503 No type found in user string!
3504 type address not found in profile
3505 User has dirsync allowed flag not set!
3506 Wrong function (M A D allowed)
3507 tried to touch user of different mailsystem
3508 Bad parameters given
3509 Group user does not exist
3510 Representative user does not exist.
3511 No connection to TCOSS server
3512 Store full.
3513 Error saving entry to TCOSS.
3550 3550 + winexec error (-->3550 to 3582)
3582 3550 + winexec error (-->3550 to 3582)
3600 general DDE error
3601 Timeout while waiting for answer from DDEAPP
3650 error WinExec
4001 Cannot Create %1, (%2) %3
4003 Lotus Notes popup message-box appeared during RichText printing. Text: %1""
4004 RichText printing 1st try failed. Restarting TC/LINK-LN process before retry. Mail from:%1, Time posted:%2, ID:%3
4005 RichText printing failed. (Non-delivery notif. will be sent to the recipient.) Mail from:%1, Time posted:%2, ID:%3
4006 RichText printing OK after link-restart. Mail from=%1, Time posted=%2, ID=%3
4007 Cannot Open %1, (%2) %3
4008 Exception %1 occured in function: %2
4009 CreateEvent (name=%1) failed. (LastErr=%2)
4010 SetEvent (name=%1) failed. (LastErr=%2)
4011 StoreFailedMail: error opening Notes database %1. Notes error=%2 (%3)
4012 StoreFailedMail: GetFirst() error. Notes error=%1 (%2)
4013 StoreFailedMail: Error opening target database %1. Notes error=%2 (%3)
4014 Periodic Notes client close failed. Link will be restarted.
4015 Shutdown event received from a parallel running link. Link will be restarted.
4016 Can't get attachment from TC %1
4021 Cannot convert Time/Date %1 to Notes format: (%2) %3
4100 CLNMailfile::GetMessage: Can't get MessagefileModifiedTime(%1) %2
4101 NotesError: (%1) %2
4103 CLNMailfile::NotifFromEnv: got zero envelope, cannot generate notif env...
4104 CLNMailfile::NotifFromEnv: Cannot get recipient from envelope: %1
4110 CLNMailfile::PostMsg Cannot get type of given envelope: %1
4111 CLNMailfile::PostMsg Error: Illegal envelope type %1
4112 Cannot get type of originator address
4113 CLNMailfile::PostMsg Error (Illegal service %1) only FREE allowed
4116 TCDateToNotesDate: Can't convert to Notes date: %1 (%2) %3
4117 TimeDateIncrement: Can't increment time %1 (%2) %3
4119 CLNDirsync::ComposeDirsyncLine Warning: Neither Field TEMPLATE nor Default Template (Type) from registry for user %1
4120 CLNDirsync::ComposeDirsyncLine: problems to write to attachment file
4122 ComposeDirsyncBody:Cannot open file %1 for writing
4123 ComposeDirsyncBody: Problems to open NABook %1 on server %2
4124 Can't convert Lastdirsync date to Notes date: %1 (%2) %3
4126 CLNDirsync::GetDirsyncMessage:Could not add dirsync body %1 to envelope; TCSI returned (%2) %3
4130 CLNDirsync::IsTimeforDirsync/ TimeDateIncrement: Can't increment time %1 (%2) %3
4131 ::IsTimeforCompact - TimeDateIncrement: Can't increment time %1 (%2) %3
4132 tcSetRegString returned error for NOTES\\LastDirsyncAt, %1
4133 ComposeTCName: Cannot DNParse Name %1: (%2) %3
4134 ComposeTCName: Problems to open NABook %1 on server %2
4135 Cannot abbreviate name %1 (%2) %3
4136 ComposeTCName: Cannot DNParse Name %1: (%2) %3
4138 Can't look up name %1 in N/A Book, (%2) %3
4139 Did not find name %1
4140 Can't look up Item %1 for Name %2 in N/A Book, (%3) %4
4141 CLNDocument::CLNDocument: Can't create Document (%1) %2
4142 CLNDocument::CLNDocument (%1) %2
4144 CLNDocument::CLNDocument Cannot access Database, (%1) %2
4145 CLNDocument::UnSign: Can't unsign Note %1: (%2) %3
4146 CLNDocument::copyToNote: Can't copy item: %1 (%2) %3
4147 CLNDocument::copyToNote: Can'find sourceitem %1 (%2) %3
4148 CLNDocument::putText: Can't create textfield %1 with value %2 (%3) %4
4149 CLNDocument::putNumber: Can't create Numberfield %1 with value %2  (%3) %4
4150 CLNDocument::putDate: Can't create Datefield %1  (%2) %3
4151 CLNDocument::putTextList: Can't ListAllocate %1 with value %2 (%3) %4
4152 CLNDocument::putTextList: Can't NSFItemAppend %1 with value %2 (%3) %4
4154 CLNDocument::putTextList: Can't create Textlist %1 with value %2  (%3) %4
4155 CLNDocument::appendTextList: Can't append to Textlist %1 with value %2 (%3) %4
4156 CLNDocument::DeleteItem: Can't delete Item %1  (%2) %3
4157 CLNDocument::DeleteNote: Can't delete Document %1 (%2) %3
4158 CLNDocument::DeleteNote: Can't close Document %1  (%2) %3
4159 CLNDocument::NewCopy: Unable to copy Note (%1) %2
4160 CLNDocument::NewCopy: generate OID (%1) %2
4161 CLNDocument::NewCopy: unable to update Note (%1) %2
4162 CLNDocument::NewCopy: unable to create Note Object
4163 CLNDocument::NewCopy: unable to create Note Object (%1) %2
4165 CLNDocument::SaveToDatabase: Unable to generate originator ID for mail box (%1) %2
4166 CLNDocument::SaveToDatabase: Unable to update note (%1) %2
4167 CLNDocument::Update: Can't Update Document %1   (%2) %3
4168 CLNDocument::~CLNDocument: Can't run Agent. Exception %1 (%2) %3
4169 CLNDocument::RenameItem: Can't Getinfo for %1
4170 CLNDocument::RenameItem: Can't get next item, %1
4171 CLNDocument::RenameItem: Can't allocate memory
4172 CLNDocument::RenameItem: Can't Add Item to %1 (%2) %3
4175 CLNDocument::~CLNDocument: Can't Update Document %1 (%2) %3
4176 CLNDocument::~CLNDocument: Can't close Document %1  (%2) %3
4177 AddFile2env: Can't Attach to envelope:
4179 NotesAttsToTC: Can't Attach to envelope:
4181 Can't get a View in PrintDatabase
4182 CreateLink: (%1),%2
4185 PrintThisNote: Can't open Temp database %1
4186 PrintThisNote: (%1),%2
4187 PrintThisNote: Can't open print databsae print.nsf
4188 PrintThisNote: (%1),%2
4189 PrintThisNote: Can't open Document in Temp database %1
4190 PrintThisNote: (%1),%2
4191 PrintThisNote: Can't open Help-About document in print database
4192 Createprocess returns Error %1l
4194 ::NotesCDToTC: exception %1 (%2) %3
4198 fixdomains: cannot canonicalize: %1, (%2),%3
4200 CLNSendDoc::putRecipient: cannot put recp1: %1, (%2),%3
4201 CLNSendDoc::putRecipient: cannot put recp2: %1, (%2),%3
4202 CLNSendDoc::putRecipient: cannot put MAIL_CORRELTATION_ITEM_NUM: %1, (%2),%3
4203 CLNSendDoc::putTime: Cannot put: (%1) %2
4204 CLNSendDoc::putSubject: Cannot put: (%1) %2
4205 CLNSendDoc::putReturnReceipt: Cannot put: (%1) %2
4206 CLNSendDoc::putDeliveryReport: Cannot put: (%1) %2
4208 CLNSendDoc::putAttachment: Cannot put %1: (%2) %3
4209 CLNSendDoc::putAttachment: Cannot put textatt: %1: (%2) %3
4210 CLNSendDoc::Send: Cannot AddRecipientsList, %1 error: (%2) %3
4211 CLNSendDoc::Send: Cannot add MAIL_SENDTO_ITEM_NUM, %1 error: (%2) %3
4212 CLNSendDoc::Send: Cannot add MAIL_COPYTO_ITEM_NUM, %1 error: (%2) %3
4213 CLNSendDoc::Send: Cannot add MAIL_BLINDCOPYTO_ITEM_NUM, %1 error: (%2) %3
4214 CLNSendDoc::Send: Cannot open %1 on Server %2, error: (%3) %4
4215 CLNSendDoc::Send: Unable to generate originator ID for mail box (%1) %2
4216 CLNSendDoc::Send: Unable to update message to router mail box (%1) %2
4217 CLNSendDoc::Send: Unable to Close Message (%1) %2
4219 CLNSendDoc::Send: Cannot Close %1 on Server %2, error: (%3) %4
4220 Cannot Close Message Error: (%1) %2
4221 CLNSendDoc::~CLNSendDoc: Cannot close Mailbox..??
4222 Languagefile tclln%1.lng not found; it must be in the program directory.
4223 Languagefile tc%1.err not found; it must be in the program directory.
4224 No memory for Stringtable.
4225 Dirsync Object returned error %1; no Dirsync possible!
4227 LINK-LN TCSI: (%1) %2
4228 ::LNK_Disable Notes Message was open; no CB occured?
4229 ::LNK_GetMsg Notes Message was open; no CB occured?
4230 LNK_GetMsg Not yet enabled...
4231 ::LNK_GetMsgCB: Callback %1 without open Notes message? (%2)
4232 ::LNK_GetMsgCB: Dirsync finished with errorcode (%1) %2
4233 ::LNK_PostMsg Notes Message was open; no CB occured?
4234 LNK_PrintObject: Can't get file %1 out of attached object:
4236 ::EmptyLocalMailBox: Cannot open server's mail.box?
4237 ::EmptyLocalMailBox: Cannot open local mail.box?
4238 ::DeleteMultipleEntries: Cannot open local print.nsf!
4239 Unable to open language file %1; trying default language
4240 Unable to open language file %1
4241 Can't open created database: %1 (%2) %3
4243 Cannot Open %1, (%2) %3
4244 Can't open Template: %1 (%2) %3
4246 Can't copy Template ACL: %1 (%2) %3
4247 Can't get template info: %1 (%2) %3
4248 Can't set template info: %1 (%2) %3
4249 CLNDatabase::Open: exception %1
4250 CLNDatabase::getDBReplica: Can't get ReplicaInfo for Database %1 (%2) %3
4251 CLNDatabase::Search exception %1
4252 CLNDatabase::Search Cannot access Database %1 with formula %2: (%3) %4
4253 CLNDatabase::OpenNote NoteOpen cannot open NoteID %1
4254 CLNDatabase::OpenNote (%1) %2
4256 CLNDatabase::SetProperties Cannot access Database, (%1) %2
4258 CLNMailfile::NotifFromEnv: cannot get MAIL_CORRELATION_ITEM_NUM: (%1),%2
4261 CLNRecvDoc::ExtractToFile: cannot get field: %1 (%2) %3
4263 CLNRecvDoc::ExtractToFile: Cannot open file %1 for writing
4264 CLNRecvDoc::ExtractToFile: file_write: could not write to file %1
4265 CLNRecvDoc::ExtractToFile: cannot get next field: %1 (%2) %3
4267 CLNMailfile::CD2RTF: cannot load NXRTF.DLL (%1),%2
4268 CLNMailfile::CD2RTF: NXRTF.DLL returned (%1),%2
4269 CLNRecvDoc::CD2RTF: Can't Attach to envelope:
4271 CLNRecvDoc::NotesDocToTC Message contains a stored form: %1
4273 CLNRecvDoc::CreateListActiveRecp: get Recipients list returned: (%1) %2
4275 CLNRecvDoc::ReturnNotesNotif without hDoc?
4276 Cannot send non-deliveryreport: (%1) %2
4277 Cannot send non-deliveryreport: (%1) %2
4279 Cannot free memory...: (%1) %2
4281 Can't get Item info for created Compound text (%1) %2
4282 Can't open file %1 for writing...
4283 Cannot lock Converted text object
4284 Can't write %1u bytes file %2
4285 Can't get Next Item info for created Compound text (%1) %2
4286 CLNRecvDoc::NotesBodyToTC: Can't open print database print.nsf
4287 CLNRecvDoc::NotesBodyToTC: (%1),%2
4288 Can't copy to Print database (%1),%2
4289 Can't copy to Print database (%1),%2
4290 Can't create compound text (%1) %2
4291 WARNING: Cannot find form %1 in the Setup database (%2) using default...
4292 Can't add Note to Compound text (%1) %2
4293 Notes Form is: %1
4294 Can't Close compound Text (%1) %2
4295 CLNRecvDoc::NotesBodyToTC Can't delete Note (%1) %2
4296 CLNRecvDoc::NotesBodyToTC: Inner Exception %1 occured
4297 CLNRecvDoc::NotesBodyToTC: Can't Attach to envelope:
4299 GetRegChanged: Cannot get %1; RegOpenKey returns %2
4300 GetRegChanged: Cannot get %1; RegQueryInfoKey returns %2
4301 GetRegChanged: exception %1
4302 GetRegChanged: Cannot close %1; RegCloseKey returns %2
4303 Cannot get %1; RegOpenKey returns %2
4304 CLNInit::SyncBranch: RegEnumKeyEx returns %1
4305 %1 contains unknown type: %2
4309 CLNInit::SyncBranch: exception %1
4310 ::SyncNote Cannot open type %1, %2=%3, (%4) %5
4311 ::SyncNote Cannot open type %1, (%2) %3
4316 ::PrepNotesForPrinting Cannot open form PrintForm in Database Printdb
4317 ::PrepNotesForPrinting exception %1 (%2) %3
4318 CLNInit::SyncRegistry Cannot access TOPCALL.NTF, (%1) %2
4319 CLNInit::SyncRegistry Cannot access Database, (%1) %2
4320 CLNInit::SyncRegistry Cannot access/create Print Database, (%1) %2
4321 CLNInit::SyncRegistry exception %1
4322 FileTime2NotesTime: FileTimeToDosDateTime returns %1 for %2l
4323 GetTempF: Unable to obtain TmpPath, error was: %1
4324 GetTempF: Unable to obtain BodyFileName, error was: %1d
4325 get_address_number: got error %1
4326 GetServerTime: Can't get Notes Server date from server %1 (%2) %3
4327 GetServerTime: Can't get Stats.Time.Current
4328 GetServerTime: Can't convert the Server's date/time %1
4329 GetServerTime: Can't find server time in string %1
4331 NotesTime2CTime: cannot convert time %1
4332 NotesTime2CTime: cannot convert time %1.%2.%3 %4:%5:%6 %7 %8
4333 AdjustNotesDate2LocalDate: Cannot adjust date: %1
4334 Cannot Get Attachment: (%1) Filename: %2, (%3) %4
4335 Can't send Document to Notes: (%1) %2
4337 Can't Create Message, (%1) %2
4338 TCLINK-LN: Incompatible Version %1, requested %2
4339 Cannot create CNotes object; Not enough Memory.
4340 Cannot create CNotesServer object; Not enough Memory.
4341 Cannot create CNotesServer object; Not enough Memory.
4342 0,01
4343 Cannot initialize NotesApi: (%1) %2
4348 Can't get Notes Server Domain from server %1 (%2) %3
4349 Can't get Stat Mail Domain %1
4350 Can't find server Domain in string %1
4351 Cannot get NotesServerName from Notes.ini MailServer entry
4352 ::GetOwnDomain Open NABOOK: %1 on Server %2, (%3) %4
4353 GetOwnDomain: cannot get Foreign Domain Document in database %1 with Selection \
4354 GetOwnDomain: cannot get Foreign Domain Document in database %1 with Selection \
4355 ::CheckDependencies Open NABOOK: %1 on Server %2, (%3) %4
4356 Cannot convert item to text (%1), %2 - %3";";check body field, it has a size but no text!"
4357 CLNSendDoc::Send: Cannot run Agent %1, error: (%2) %3
4358 GetTempF: Unable to create Temp-Path, error was: %1d
4359 Failed to compact database %1 (error: %2,%3)
4360 tcSetRegString returned error for NOTES\\CompactAt, %1
4361 No valid license for TC/MWA-LN
4362 CLNRecvDoc::CLNRecvDoc: Message was sent before, but not deleted (%1 - UNID: %2-%3)
4364 closeNotesClient: Call LoadLibrary() failed. (Tried to load PSAPI.DLL.) LastError:%1
4365 closeNotesClient: Call EnumProcesses() failed. LastError:%1
4366 closeNotesClient: Can't terminate Notes client process: '%1', LastError:%2
4367 closeNotesClient: Can't terminate Process with loaded TCLLN.DLL (%1), LastError:%2
4368 closeNotesClient: Call OpenProcess() failed. LastError:%1
4369 closeNotesClient: Unable to bind %1. (Call GetProcAddress() failed.) LastError: %2
4370 closeNotesClient: Call EnumProcessModules() failed. LastError:%1
4380 TC/LINK-LN cluster fail-over to Lotus Domino server '%1' done OK.
4381 Lotus Domino server '%1' does not work properly. (%2) %3
4382 TC/LINK-LN cluster fail-over failed (%1) %2.
4383 TC/LINK-LN cluster fail-over failed. Could not set poll server to '%1'.
4384 Lotus Domino server '%1' resumed working, TC/LINK-LN connected OK.
4385 Error updating foreign domains on server '%1'. (%2) %3
5002 general TC/LINK Error
5003 No KCS queue users for %1
5004 TCIMGIO cannot convert fax image to graphic format
5005 error opening temp. file with binary attachment
5006 Unknown attachment type.
5007 message has no header
5009 Error %1 (%2) creating temporary file in %3
5010 mail attachment is no known image format (no TCIMGIO conversion)
5011 File attachment without name
5012 document conversion returned OK, but no coverted image
5013 Error %1 in RTF conversion: %2
5014 invalid int_state in notification from mail
5015 error connecting to TCLIB32.DLL
5016 nondel notif created, but not needed, therefore deleted
5017 Windows NT Error %1 (%2) during stop event creation
5018 unable to map an address
5019 Unable to start RPC communication
5020 Error opening mapfile
5021 Syntax error in mapfile: line %1 (%2)
5022 Bad or missing parameter in mapfile rule %1 (line %2)
5023 shadow user not found
5024 Error opening file %1
5025 object not found
5026 error in link startup
5027 Invalid Lotus Notes X400 address %1
5028 error loading TCDC32.DLL
5029 error loading USRDDE.DLL
5030 error loading special link DLL
5031 error loading TCIMG32.DLL
5032 error finding explicitely linked DLL function
5033 invalid message type
5034 Windows NT error %1 (%2) creating main thread for TCLINK
5035 Error allocating memory
5036 error freeing allocated memory
5037 Error in ++ command
5038 Error loading TCVIEW32.OCX
5039 Error allocating memory for address mapping rules
5040 TC/LINK cannot connect to KCS server. TCSI error %1 (%2).
5041 Invalid password for link user %1.
5042 Link user %1 does not exist.
5043 TC/LINK - %1 registration limit reached
5044 %1 license has timed out.
5045 Error finding function %1 (%2) in module %3
5046 File C:\TCOSS\TCCLIENT.INF is missing or corrupted.
5047 TC/LP version is %1 instead of %2.
5048 Version error in module %1: Version is %2 instead of %3
5049 Error %1 reading version information of module %2
5050 cannot read mapfile
5051 error reading KCS service store
5052 caller tries conversion without previous initialization
5053 mandatory configuration value(s) missing from registry
5054 error opening file TCLICVxx.LNG or file TCxx.ERR
5055 error in message conversion
5056 error streaming TCSI object to file
5100 Wrong checksum in file %1
5101 Error loading module %1
5102 %1: Internal error %2 (%3)
5103 Error %1 initializing mail DLL
5104 Inactivity timeout expired. TC/LINK stopped.
5105 No valid license for %1.
5106 TCIMGIO conversion (%1 to %2) returned error %3 (%4)
5107 %1 errors during Dirsync
5108 Error %1 (%2)  creating performance counter object %3
5109 Error %1 (%2) adding performance counter %3
5110 Template %1 cannot be opened
5111 Message originator is not allowed to send to direct number. Message refused.
5112 Service restriction: recipient is set inactive because it has no allowed addresses. This message needs an authorizer.
5113 No authorizer: one or more recipients need an authorizer, but the message contains no authorizing recipient.
5114 Dirsync: TCUIDIO returned error %1 (%2) for line %3
5115 Error %1 in document conversion: %2
5116 %1: Internal error %2 (%3)
5117 Warning: Module %1 is DEBUG Version.
5118 Dirsync completed: %1 users/recipients added, modified or deleted.
5119 TC/LINK-%1 Version %2 started
5120 TC/LINK version %1 stopped by %2
5121 Message '%1' from %2 to %3 may contain a virus in attached file %4.
5122 Invalid TCOSS version for archiving (%1).
5123 Document converter needed but disabled.
5130 Fatal error converting RTF message body.
5131 Temporary error in mail system access
5132 Link enters idle mode (temporary problem)
5133 Link leaves idle mode
5134 Message from key system could not be posted to TCOSS due to loss of connection
5135 Corrupted message from key system was discarded
5136 Virus checker timeout occurred with %1
5137 Cannot start virus checker (%1)
5138 The password for KCS user %1 will expire in %2 days
5139 The password for KCS user %1 has expired.
5140 Invalid password for KCS user %1. The next attempt will lock the account.
5141 The KCS user account %1 has been locked.
5142 Notification loop detected. Subject is %1.
5143 Notification loop detected, text notification discarded.
5144 Notification loop detected, notification discarded.
5145 Full dirsync deleted user / recipient %1.
5146 Loaded EXIT DLL %1
5147 Message aborted by link exit
5148 Link stopped by link exit
5149 TCLINK_FI_100: 100 messages sent today. Message discarded.
5150 TCLINK_FI_100: Cannot access message count. Message discarded.
5151 Per user license expired. Unable to register user %1.
5152 File %1 cannot be converted. TCDC rejects files with this extension.
5153 Cannot create nondelivery notification to mail system (for msg %1 from %2)
5154 Message ignored by link exit
5155 Message %1 link exceeds size limit (size is %2)
5156 Fatal document conversion error.
5157 Possible TCOSS Handle Problem
5600 ADSI error number: %1.
5601 LDAP error: %1; %2.
5602 Syntax error in registry parameter: %1.
5700 %1: Memory allocation failed.
5701 %1: Error %2 accessing property %3
5702 %1: error %2 binding to %3
5703 For dirsync to run, you must set %1 or %2 to 1
5704 Missing registry key: %1
5705 %1: Error %2 retrieving Dirsync attribute %3
5706 %1: an exception occurred
5707 %1: Internal error %2 (%3)
5708 Invalid user filter
5709 Invalid recipient filter
5750 Dirsync cannot start: %1 '%2'
5751 Error '%1' building dirsync record for user '%2'
5752 No usable LDIF records in file '%1'
5800 %1: invalid parameters
5801 %1: recipient name missing
5802 %1: image file path missing
5803 %1: user image path missing
5804 %1: user name missing
5805 %1: message name missing
5806 %1: service name missing
5807 %1: invalid InitMode parameter %2
5808 %1: invalid TC session handle(s)
5809 Message %1 successfully created
5810 User %1 successfully created
5811 Successfully logged on to server %1 as user %2
5812 Successfully logged off from KCS
5813 Queue user %1 successfully created
5814 Service %1 successfully created
5815 Addressbook entry %1 successfully created
5816 User %1 exists, but is no queue user
5817 %1: addressbook entry %2 does not exist
5818 Addressbook entry %1 cannot be written to file %2. See previous log entries
5819 %1: User %2 does not exist
5820 User profile %1 cannot be written to file %2. See previous log entries.
5821 %1: message %2/%3 does not exist
5822 Message %1 cannot be written to file %2. See previous log entries.
5823 %1: service %2 does not exist
5824 Service %1 cannot be written to file %2. See previous log entries.
5825 Message %1 cannot be created, error %2 (%3). See previous log entries.
5826 TC object cannot be stored, as it was updated by another user. Try again later.
5827 User %1 cannot be created. A recipient with the same name already exists.
5828 User %1 cannot be created, error %2 (%3). See previous log entries.
5829 Addressbook entry %1 cannot be created, error %2 (%3). See previous log entries.
5830 Service %1 cannot be created, error %2 (%3). See previous log entries.
5831 File %1 cannot be opened for reading.
5832 Error %1 (%2) reading from file %3. Bad TCSI image.
5833 TCSI error %1(%2)  in %3, object %4
5834 Error %1(%2): cannot log on to server %3
5835 Queue user %1 cannot be created because an addressbook entry already exists.
5836 Queue user %1 cannot be created, because a normal user with the same name already exists.
5837 %1: not enough memory.
5838 A service %1 already exists, prefix is %2 instead of %3
5839 A service %1 already exists, address type is %2 instead of %3.
5840 Addressbook entry %1 successfully written to file %2
5841 User %1 successfully written to file %2
5843 Message %1 successfully written to file %2
5844 Service %1 successfully written to file %2
6000 error reading configuration from registry
6001 target format is invalid
6002 cannot create stop event
6003 cannot start RPC communication
6004 stopped by TCSRV (no real error)
6005 no conversion needed, message is already converted
6006 error opening temp. file
6007 error reading data from temp. file
6008 error finding TCIMGIO parameters for target format
6009 error finding path for temp. files (environment var TMP" or "TEMP")"
6010 error creating temp. file name
6011 TCIMGIO cannot convert fax image to target format
6012 unknown TCSI object encountered
6013 No valid license for %1. Messages are not converted.
6014 TCOCR.DLL is missing. OCR is disabled
6015 OCR is disabled at TCDC but requested by TCOSS
6016 TCDC version %1 started
6017 TCDC_MIME.DLL missing. Embedded Image support disabled.
6018 Signature server returned error, see file %1
6019 Timeout waiting for signature server (folder %1)
6020 Error %1 copying file %2 to %3
6021 Retrieve signature later (async mode)
7002 Incompatible Version of TCMIME.DLL (is %1 instead of %2)
7003 Temporary Directory %1 not accessable (%2)
7004 Failed to start Winsock (TCP/IP stack)
7005 Local domain name missing (Registry %1); using fallback to %2""
7006 No MX record found for own domain %1"
7007 Resolution of localhost %1" to IP address failed (%2)
7008 resolving smarthost %1" failed (%2)
7009 No listener enabled (Registry %1 = 0?)
7010 Error starting Listener thread %1 (%2)
7011 Low disk space (only %1 Bytes left)
7012 No DNS server found - DNS Direct delivery disabled
7100 Restarting Listener Failed (%1)
7101 Creation of main listener socket failed (%1)
7102 Error binding main listener socket (%1)
7103 Error listening on main listener socket (%1)
7104 Failed to set socket parameters (%1)
7105 Creation of event object failed (%1)
7106 Could not create temporary reception file %1 (%2)
7107 Connection attempt from %1 (to %2) rejected because of IP filtering (Registry %3, %4)
7200 Creation of polling socket failed (%1)
7201 polling of smarthost %1" failed (%2)"
7202 Could not create message %1" to local postmaster (%2)"
7203 Error within SSL initialization %1
7204 SSL Accept failed %1
7205 SSL Connect failed %1
7206 SSL verification problem %1 %2
7207 Error %1" during SMTP reception, no message received."
8002 %1 directory not defined!
8003 %1 directory not accessable!
8004 %1 directory full;
8005 Cannot remove file %1 (%2)
8006 Cannot open file %1 (%2)
8007 Cannot rename file %1 to %2 (%3)
8200 Both LINKXML and LINKSM registry hive specified! Only one method possible!
8201 No correct LINKXML or LINKSM registry hive specified!
8202 Opening %1 failed! %2
8203 Problem when writing to file %1:%2
8204 CreateTmpFile: File %1 search error (%2)
8205 Hostname incomplete => buffer too short
8206 Accept data failed fatal. Error: %1
8207 SSL Error: %1
8208 SSL Error: connection problem: %1
8209 Changing socket failed. Error: %1
8210 Select socket failed. Error: %1
8211 XML data is not wellformed (%1)
8212 Sending data failed. Error: %1
8213 TCP Socket not closed gracefully. HTTP Response possibly not been received by HTTP Server!
8214 WSAStartup failed. Error: %1
8215 Allocating socket failed. Error: %1
8216 Unable to get the host information for %1. Error: %2
8217 Connecting to the server %1 failed. Error: %2
8218 Recipient contains no valid host name!
8219 Server %1 is reachable again
8220 SSL Error: verification problem: %1 %2
8221 (tcsoapSend) Receive HTTP Response - Socket Error: %1
8222 (tcsoapsend) Timeout waiting for response from server. Duplicate sending possible!
8223 Shutdown of socket failed %1
8224 Closing of socket failed %1
8225 Message (%1) was not sent successfully to Host!
8226 Ignoring XML elements starting with %1
8400 %1: %2 (Return Code: %3)
8401 Immediate Non-Delivery Notification created; %1
8500 Fetch agent requires ADO ver.2.5 and higher to be installed!
8501 Report agent requires ADO ver.2.5 and higher to be installed!
8502 Fetch Agent: TCLIB32.DLL initialization failed!
8503 Report Agent: TCLIB32.DLL initialization failed!
8504 Fetch Agent: TCIPC.DLL initialization failed!
8505 Report Agent: TCIPC.DLL initialization failed!
8506 Fetch Agent: Error processing registry: %1
8507 Report Agent: Error processing registry: %1
8508 Fetch Agent: Error reading registry: %1
8509 Report Agent: Error reading registry: %1
8510 Fetch Agent: Attempt %1, Error connecting to KCS server: %2; User ID: %3; Error: %4
8511 Report Agent: Attempt %1, Error connecting to KCS server: %2; User ID: %3; Error: %4
8512 Fetch Agent: Attempt %1, Error connecting to SQL server: %2; User name: %3 Error: %4
8513 Report Agent: Attempt %1, Error connecting to SQL server: %2; User name: %3 Error: %4
8514 Report Agent: Error converting date/time value in command message
8520 TC/REPORT - Fetch Agent ver. %1 started
8521 TC/REPORT - Report Agent ver. %1 started
8522 TC/REPORT - Fetch Agent ver. %1 stopped because of error
8523 TC/REPORT - Report Agent ver. %1 stopped because of error
8524 TC/REPORT - Fetch Agent ver. %1 stopped by TC/SRV
8525 TC/REPORT - Report Agent ver. %1 stopped by TC/SRV
8530 %1 of maximum size of the database reached.
8531 Fetch Agent User:  %1 logged in to KCS Server: %2
8532 No ServerID in database specified!
8533 Localized address:  %1 does not contain part before colon!
8534 Report Agent User:  %1 logged in to KCS Server: %2
8535 Maximum size of the database reached. Deleting oldest entries.
8536 Report agent sent report message!
8537 INFO: Check DESTINATION in command message:  %1
8538 Report Agent sent error message to user %1 !
8539 Error adding parameter value: %1 !
8540 Crystal Report engine: Error #: %1 - %2
8541 No printer driver installed!
8542 TC/REPORT user is not allowed to read the User Profile.
8543 User  %1 is not allowed to generate reports.
8544 Report will not be created!
8545 Source path:  %1 Target path: %2
8546 Report  %1 required in report message %2 not found!
8547 Error by converting the date/time value in report message!
8548 Incorrect %1 field in Server table!
8549 Server table might be empty. Use TC Management Console to check it!
8550 Selected attachment format not supported by report agent!
8551 Fetch Agent sent info message to user %1 !
8552 Fetch agent requires TCREPORT-Database version %1 or higher
8553 No Server specified!
8554 User %1 needs additional rights (%2)
8555 Possible ID field overrun in table %1: current value = %2 - limit = %3
8556 'max server memory' cannot be changed: %1 (%2)
8557 Due to database size restrictions, value DBMaxSize is changed from %1 to %2
8558 Fetch Agent: Connection to database available again.
8559 Fetch Agent: Connection to TCREPORT database lost.
8560 Setup cannot grant create database to user %1. Error: %2
8561 Error writing into table %1
8562 User %1 is not allowed to list all in and outboxes on server %2
8563 User %1 is not allowed to open all in and outboxes on server %2
8564 User %1 is not allowed to read user profiles on server %2
8565 User %1 is allowed to list all in and outboxes on server %2
8566 User %1 is allowed to open all in and outboxes on server %2
8567 User %1 is allowed to read user profiles on server %2
8568 Cannot read event log of computer %1
8569 Please change to simple recovery model!
9000 Internal TFC Error.
9001 invalid codepage specified
9002 invalid or no application session
9003 invalid type of permanent store
9004 invalid or no server session
9005 earch in folder display timed out
9006 invalid parameter in call to TFC method
9007 the supplied object was empty
9008 Unknown Error Number  %1, facility %2
9009 unable to interprete path
9010 Unable to detach unknown content (%1) %2
9011 Unable to create file %1, error %2
9500 TCOSS Web Services are stopped due to {%1} in xx component {%2}.
11500 Duplicate sending suspected
11501 Invalid SMTP address
11502 Invalid DTMF address
11503 No MultiFax user profile found
11504 MultiFax user property missing
11505 Invalid destination address
11506 Registry value missing
11507 CoInitialize failed
11508 No CSV record for OCR conversion
11509 Exception occurred
11510 Temp file creation failed
11511 Internal error
11512 Checkbar not valid
11513 Inconsistency with DL numbers
11514 Error creating stop event
11515 Cannot connect to TCSRV
11516 No servers defined
11517 Current fax page is no coversheet
11518 No send retry possible. Not enough space for temporary distribution list on server %1.
11519 job request rerouted to other TCOSS instance
11520 Originator not found in routing table
11521 job originator exists in several TCOSS instances
11522 Cannot log in to remote TCOSS, job request cannot be routed
11523 Cannot post job request to remote TCOSS
11524 Connection to TCOSS server has been lost
11800 An exception occurred
11801 File cannot be opened
11802 Follow up error
12000 Error creating main listener socket (%1)
12001 Unknown TCP Protocol name %1
12002 Error binding to used port %1
12003 listen() failed with %1
12004 Connection Manager AcceptEx () call failed (%1)
12005 Failed to start Worker Thread (%1)
12006 Refused connection from %1 because of IP address rights
12007 OnAccept overload failed
12008 OnDataAvailable (text) overload failed
12009 OnDataAvailable (binary) overload failed
12010 OnError overload failed
12011 anonymous login failure (%1)
12012 missing protocol DLL
12013 invalid protocol DLL (missing PH_CreateSession)
12014 Incompatible Version of protocol DLL
12015 Incompatible Version of TCMIME.DLL
12016 Could not create Application session (%1)
12017 Logon failure (System user - %1)
12018 protocol DLL initialization failed
12019 failed to load WINSOCK-2 DLL (%1)
12020 failed to build IOCP (%1)
12021 Failed to start Connection Manager
12100 incompatible version of TCSX.DLL
12101 TCSX.DLL init failed
12102 Ending process TCSX
12103 Connection Manager failed; shutting down ...
12104 Starting process TCSX
12200 TCLI_Convert: not initialized (%1)
12500 Incompatible version of TCPOP3.DLL
12501 Creation of local inbox failed
12502 Resizing of local inbox failed
13001 %1: error %2 opening default message store
13002 %1: The Exchange server on %2 is not running !
13003 Error %1 (%2) opening Service Control manager on '%3'
13004 Error %1 (%2) opening service '%3'
13005 MSExchangeSA is not running, status %1
13006 MSExchangeDS is not running, status %1
13007 MSExchangeMTA is not running, status %1
13008 MSExchangeIS is not running, status %1
13009 %1: error allocating memory
13010 Error %1 creating temporary file: %2
13011 %1: internal error %2 (%3)
13012 %1: Error %2 opening MSGTOEX folder (%3)
13013 %1: Error %2 cleaning MSGToEX folder (%3)
13014 A message (MTS_ID = %1, class = %2) from Exchange cannot be converted to KCS format.
13015 A message (filename = %1,subject = %2, class = %3) from KCS cannot be transferred to Exchange.
13016 %1: Bad message format in message from Exchange. Creation of non-delivery notification impossible.
13017 %1: An error occurred during directory export from Exchange. Check the spelling of registry values Exchange\DSListxx.
13018 Message from Exchange has non-standard message class %1
13019 %1: non-binary attachment, is ignored
13020 Dirsync error: no dirsync attributes in registry (Exchange\DSListxx)
13021 Dirsync cannot create export file %1: %2
13022 %1: internal error %2 (%3)
13023 %1: MAPI function %2 returned error %3: %4 (Component %5, Context %6)
13024 %1: MAPI function %2 returned error %3: %4 (Component %5, Context %6)
13025 %1: internal TCSI error (%2) %3
13026 %1: error creating one-off address for %2 %3:%4
13027 A message in error  was written to file %1
13028 The limit of %1 KB of the error directory %2 is reached. No further files are written to this directory.
13500 APPLI/COM directory names are not configured
13501 The APPLI/COM directories cannot be accessed.
13502 Cannot create test file %1 in APPLI/COM job directory.
13503 Cannot create test file %1 in APPLI/COM out directory.
13504 Cannot create test file %1 in APPLI/COM error directory.
13505 Cannot delete file %1 from APPLI/COM job directory
13506 Cannot delete file %1 from APPLI/COM out directory.
13507 Cannot delete test file %1 from APPLI/COM error directory.
13550 Error in transaction file %1. Moving file to the APPLI/COM error directory.
13551 Cannot move file %1 to APPLI/COM error directory.
13552 Cannot create file %1 in APPLI/COM ack directory
13553 Cannot write to file %1 in APPLI/COM IN directory
13554 Cannot save file %1 to APPLI/COM IN directory.
13555 Cannot create file %1 in APPLI/COM IN directory
13556 Cannot create test file %1 in APPLI/COM in directory
13557 Cannot delete test file %1 from APPLI/COM in directory
13558 Cannot create test file %1 in APPLI/COM ack directory
13559 Cannot delete test file %1 from APPLI/COM ack directory
13600 TCP Socket could not be opened.
13601 SOCKET_ERROR occurred after successful start and properly working.
13605 Error Opening socket: Error %1
13610 The network name of the GSM interface could not be resolved to an valid IP-address.
13611 TC/LINK-WM could not connect to the GSM interface via the required port without reset of the GSM interface connections.
13612 Connection failed because of other reasons like timeouts, ...
13613 GSM Interface's connection reseted because: %1 was connected!
13615 connection to the %1 (%2) on CONFIG Port failed!
13620 Receiving of information from the GSM interface failed.
13630 For some reason the GSM Interface closed the connection to the TC/LINK-WM.
13640 The GSM interface did not respond to an AT command.
13641 Wrong PIN code
13642 The number of the provider's SMSC was not accepted.
13645 No SIM card is installed in the GSM interface
13646 Could not register at any provider.
13647 Could not register at a provider - still searching
13648 This SIM card is not allowed to register at this provider.
13650 An output file could not be created.
13651 An input file could not be created.
13670 An unexpected TCSI Error occurred.
13680 No accepted recipient or SMSC problems. Falcom A1 returned: %1
13681 GSM Modem returned: %1
13682 GSM Modem returned: %1
13683 GSM Modem returned: %1
13699 The wrong DLL of the TC/LINK-WM is installed.
13700 TCLMD Error: %1 (%2, %3)
13701 TCLMD Error: %1
14000 Config File GATEWAY.DAT does not exist in directory %1
14001 Wrong gateway name for TC/LINK-X4: KCS's %1, MTA's %2
14002 Input directory %1 does not exist or not accessible
14003 Output directory %1 does not exist or not accessible
14004 PostMsg: not yet enabled
14005 PostMsg: Illegal envelope type
14006 PostMsg: Illegal message type: %1, TCSI error: %2
14007 PostMsg: Can't read %1-th attachment from TCMsg %2 TCSI error: %3
14008 PostMsg: Can't add %1-th attachment from TCMsg %2, XOPEN API error: %3
14009 PostMsg: Can't read originator from TCMsg %1, TCSI error: %2
14010 PostMsg: Can't add originator from TCMsg %1, XOPEN API  error: %2
14011 PostMsg: Can't read %1-th recipient from TCMsg %2, TCSI error: %3
14012 PostMsg: Can't add %1-th recipient from TCMsg %2, XOPEN API error: %3
14013 PostMsg: Problem with IPM content, TCMsg is %1 XAPI error: %2
14014 PostMsg: Msg cannot be transferred out,  TCMsg is %1 XOPEN API error: %2
14015 GetMsg: not yet enabled
14016 GetMsg: %1-th attachment is of not supported type
14017 GetMsg: Can't read %1-th attachment, XOPEN API error %2
14018 GetMsg: Can't add %1-th attachment TCSI error: %2
14019 GetMsg: Can't read originator XOPEN API error %1
14020 GetMsg:  Can't add originator, TCSI error: %1
14021 GetMsg: Can't read %1-th recipient, XOPEN API error %2
14022 GetMsg: Can't add %1-th recipient, TCSI error code: %2
14023 GetMsg:  Can't read IPN, XOPEN API error: %1
14024 GetMsg: Can't convert IPN to KCS notification, TCSI error: %1
14025 GetMsg: Can't read IPM content, XOPEN API error: %1
14026 GetMsg: Can't read X.400 delivery/non-delivery notification, XOPEN API error: %1
14027 GetMsg:  Can't convert X.400 delivery/non-delivery notification to KCS notification TCSI error: %1
14028 PutMsg: XOPEN API error: %1, Program Context: %2 XOM function: %3 XOM Object Type: %4 XOM Syntax: %5
14029 GetMsg: XOPEN API error, %1 Program Context: %2 XOM function: %3 XOM Object Type: %4 XOM Syntax: %5
14030 XOPEN API library could not be initialized, XOPEN API error %1, file GATEWAY.DAT in directory %2 damaged
14031 GetMsg: XOPEN API error, Program Context: %1 XOM function: %2 XOM Object Type: %3 XOM Syntax: %4 Attribute value: %5
15000 Error on starting SAPconnect receiver thread, Windows NT error %1
15001 %1 can't register at SAP gateway, RFC function: %2 RFC error string %3
15002 %1 can't logon to R/3 application server, RFC function: %2 RFC error string:  %3
15003 Persistant RFC Server error
15004 PostMsg: not yet enabled
15005 PostMsg: Illegal envelope
15006 PostMsg: Illegal message type %1, TCSI error: %2
15007 PostMsg: Can't read %1-th attachment from TCMsg %2, TCSI error %3
15008 PostMsg: Can't add %1-th attachment from TCMsg %2
15009 PostMsg: Can't read originator from TCMsg %1 TCSI error: %2
15010 PostMsg: Can't add originator from TCMsg %1
15011 PostMsg: Can't read %1-th recipient from TCMsg %2 TCSI error: %3
15012 PostMsg: Can't add %1-th recipient  from TCMsg %2
15013 GetMsg: not yet enabled
15014 GetMsg: Can't read %1-th attachment
15015 GetMsg: Can't add %1-th attachment, TCSI error: %2
15016 GetMsg: Can't read originator
15017 GetMsg: Can't add originator, TCSI error: %1
15018 GetMsg: Can't read %1-th recipient
15019 GetMsg: Can't add %1-th recipient, TCSI error: %2
15020 GetMsg: Can't read SAPconnect notification
15021 GetMsg: Can't convert SAPconnect notification to KCS notificationTCSI error: %1
15022 GetMsg: Not enough space on disk for temporary file, current disk space is  only %1 [kBytes]
15023 GetMsg: Can't create temporary file in directory %1, Windows NT error %2
15024 GetMsg: Can't write temporary file %1, TCSI error %2
15025 RFC exception %1  occured
15026 %1 connection error, RFC function: %2 RFC error string: %3
15027 RFC timeout exceeded %1 seconds
15028 SAPconnect Internal table handling error, Program Context: %1 Function: %2
15029 The user %1 has deleted the instance %2
15030 The user %1 has changed the RFC Client parameter of instance %2: %3
15031 The user %1 has changed the RFC Server parameter of instance %2: %3
15032 The user %1 has changed the RFC Logon parameter of instance %2: %3
15033 The user %1 has changed the KCS parameter of instance %2: %3
15034 The user %1 has created the instance %2
15500 Init: unable to get TLS index (%1)
15501 Init: CreateMutex failed (%1)
15502 %1: Registry access failed (%2)
15503 Init Mappping: CreateFileMapping failed (%1)
15504 Init Mappping: MapViewOfFile failed (%1)
15505 Init Mapping: HeapAlloc failed (%1)
15506 %1: Registry access failed (%2)
15507 %1: no space left;  Namespace=%2,  Objects=%3
15508 Add performance object: object %1 not found
15509 Add performance object: index table full
15510 Get base index: Can't determine base index, using default %1
15511 Init Registry: Unable to init API in registry (%1)
15512 Add system name: name string too long ( len = %1)
15513 Add system name: Resulting list too short %1 greater than %2
15514 Create new name: collision at %1, localname=%2, systemname=%3
15515 Can not entirely remove object %1, it has %2 counters in %3 instance(s) left
15516 Disc space (%1) for trace files is running low. You may need to remove some files.
15520 KCS Performance Counters: %1
15521 KCS Performance Counters: %1
15522 KCS Performance Counters: %1
15901 TCDISK copy from %1" to "%2" mode %3 completed ok"
16000 TCOSS test Message Par1=%1,  Par2=%2,  Par3=%3,  Par4=%4,  Par5 =%5
16001 Info: %3 in %1
16002 Warning: %3 in %1
16003 A channel stopped working due to wrong configuration, insufficient license or line errors. Error message: %3  in %1
16004 An error that could be corrected (e.g. by reloading an interface) occurred. Error message: %3 in %1.
16005 An unrecoverable error occurred. Parts of the system may not be available anymore. Error Message: %3 in %1.
16006 System has been stopped due to error: %3 in %1
16011 Info %3 in %1 (Additional information: %2)
16020 %3 has been stopped due to a link error between %4 and %3.  (Error details: %5)
16021 %3, %6 have been stopped due to a link error between %4 and %3. (Error details: %5)
16022 Reloading %3 failed due to link error between %4 and %3. (Error details: %5)
16023 Reloading %3 failed due to link error between %4 and %3. %6 are still not usable. (Error details: %5)
16024 %3 license will expire within %4 days.
16025 %3 license expired.
16026 More than 80 percent of KCS disk space is in use.
16027 More than 90 percent of KCS disk space is in use. Reception has been stopped.
16028 Free disk space has increased to 20 percent or more.
16029 Status Agent access timeout on connection %3 from %4 Master via %5.
16030 Status Agent connection %3 from %4 Master via %5 is now OK
16031 TCOSS %3 (using module TCOSS.EXE %4) started
16032 TCOSS has been stopped by %3
16033 Time-out in TCOSS channel %3 running on %5.
16034 %1 could not create an inbound sendorder with caller Id %3.  (Response bad originator" to command: %4)"
16035 Fax coded data (FCD) with %3 data bytes received. Because maximum allowed data length is 256 bytes, this error indicates a T.4 violation of the transmitting fax machine. It is not caused by bad line conditions.
16036 The KCS Archive is stopped or has no connection.
16037 The routing directory (rr99) is out of space. Some lines are not stored!
16038 An internal TCOSS module (Start-TUP) has been detected to be inactive for an unexpected period. The last activity was: %3""
16039 An internal TCOSS module (Start-TUP) is inactive. The last activity was: %3""
16040 Update of Disk %3 has been completed. Tandem operation is resumed.
16041 An internal TCOSS module (Start-TUP) has been detected to be inactive for %3 Milliseconds and is now active again.
16042 A/u-law configuration missmatch detected: %3-Law coding is used on channel %1!
16043 An internal Configuration File (+TECH/ALOADERTABLE) could not be opened. This can happen if TCOSS is installed without installing the configuration with WCONFIG.
16044 Reference Clock on Line Server %1 is not synchronised with %3 on %4.  The current reference clock source is set to %5.
16045 Reference Clock on Line Server %1 could be synchronised with %3 on %4.  The current reference clock source is set to %5.
16046 Line for TCOSS Channel %3 has been disconnected.
16047 Line for TCOSS Channel %3 has been reconnected.
16048 Node %3 has been rebooted successfully
16049 Configuration file %3 not found, channel %4 not started
16050 failed to load alert for queue %3, error %4
16051 detected invalid alert for queue %3 (folder %4, file %5, trigger %6, reactivate %7)
16052 failed to post alert message, folder %3 file %4 error %5
16053 Process will be stopped due the following fatal problem: %1
16054 Avg. local disk  time %2 ms exceeded avg.limit,  peak was %3 ms, %4 perc. values exceeded peak limit (%5 ms), %6 perc. values exceeded avg.limit (%7 ms) during last %8 sec
16055 Peak local disk time %2 ms exceeded peak limit, average was %3 ms, %4 perc. values exceeded peak limit (%5 ms), %6 perc. values exceeded avg.limit (%7 ms)  during last %8 sec
16056 Avg. remote disk  time %2 ms exceeded avg.limit,  peak was %3 ms, %4 perc. values exceeded peak limit (%5 ms), %6 perc. values exceeded avg.limit (%7 ms) during last %8 sec
16057 Peak remote disk time %2 ms exceeded peak limit, average was %3 ms, %4 perc. values exceeded peak limit (%5 ms), %6 perc. values exceeded avg.limit (%7 ms)  during last %8 sec
16058 Avg. disk network delay  time %2 ms exceeded avg.limit,  peak was %3 ms, %4 perc. values exceeded peak limit (%5 ms), %6 perc. values exceeded avg.limit (%7 ms) during last %8 sec
16059 Peak disk network delay time %2 ms exceeded peak limit, average was %3 ms, %4 perc. values exceeded peak limit (%5 ms), %6 perc. values exceeded avg.limit (%7 ms)  during last %8 sec
16060 Avg. local disk time %2 ms is within avg.limit again,  peak was %3 ms, %4 perc. values exceeded peak limit (%5 ms), %6 perc. values exceeded avg.limit (%7 ms) during last %8 sec
16061 Avg. remote disk time %2 ms is within avg.limit again,  peak was %3 ms, %4 perc. values exceeded peak limit (%5 ms), %6 perc. values exceeded avg.limit (%7 ms) during last %8 sec
16062 Avg. disk network delay time %2 ms is within avg.limit again,  peak was %3 ms, %4 perc. values exceeded peak limit (%5 ms), %6 perc. values exceeded avg.limit (%7 ms) during last %8 sec
16063 Node %1 avg. round-trip time %2 ms exceeds avg.limit,  peak was %3 ms, %4 perc. values exceeded peak limit (%5 ms), %6 perc. values exceeded avg.limit (%7 ms) during last %8 sec
16064 Node %1 peak round-trip time %2 ms exceeds peak limit,  avg. was %3 ms, %4 perc. values exceeded peak limit (%5 ms), %6 perc. values exceeded avg.limit (%7 ms) during last %8 sec
16065 Node %1 avg. round-trip time %2 ms is withing avg.limit again,  peak was %3 ms, %4 perc. values exceeded peak limit (%5 ms), %6 perc. values exceeded avg.limit (%7 ms) during last %8 sec
16066 Media server %1 avg. round-trip time %2 ms exceeds avg.limit,  peak was %3 ms, %4 perc. values exceeded peak limit (%5 ms), %6 perc. values exceeded avg.limit (%7 ms) during last %8 sec
16067 Media server %1 peak round-trip time %2 ms exceeds peak limit,  avg. was %3 ms, %4 perc. values exceeded peak limit (%5 ms), %6 perc. values exceeded avg.limit (%7 ms) during last %8 sec
16068 Media server %1 avg. round-trip time %2 ms is withing avg.limit again,  peak was %3 ms, %4 perc. values exceeded peak limit (%5 ms), %6 perc. values exceeded avg.limit (%7 ms) during last %8 sec
16069 TCOSS has been connected to FoIPv3 %3 on node %1
16070 Operator has cleared disk %3
16071 Disk update %3 -> %4 started
16072 Tandem startup: only disk %3 is valid
16073 Tandem startup: only disk %3 is up-to-date
16074 Tandem startup: disk update required after dirty shutdown
16075 Tandem startup: disks are synchronized, no update is required after clean shutdown
16076 TCOSS-Secondary: starting in tandem mode with primary server
16077 TCOSS-Secondary: can not access primary server, starting as standalone server
20000 API directory not accessible (%1)
20500 Index thread could not be started (%1)
20501 Not enough memory to continue update
20502 Error opening index file (%1)
21000 TC/ARCHIVE release %1 started
21001 Startup information: archive path %1 closed online volumes: %2, maximum: %3%4
21002 Startup information: archive has %1 volumes
21003 New archive volume %1 complete
21004 TC/ARCHIVE process terminated by operator.
21005 CD #%1 of volume %2 has been written and verified
21100 Stop word file %1 too long, truncated.
21101 Unable to open stop word file %1.
21102 Unable to access logical drive %1 (error %2).
21103 Create file %1 mode %2 error %3.
21104 Write file position %1 size %2 written %3 Bytes error %4.
21105 Read file position %1 size %2 read %3 Bytes error %4.
21106 Remove Directory %1 error %2.
21107 Transaction start error %1.
21108 Transaction commit error %1.
21109 Corrupt %1 file record at position %2.
21110 Move volume %1 to path %2 error %3.
21111 Volume %1 has not been saved to CD yet (it will be due for cyclic deletion).
21112 Disk full, extra cyclic delete / move to secondary path performed to free disk space.
21113 Document content (folder %1 file %2) already removed from short term archive.
21114 Linked attachment (folder %1 file %2) not found on KCS Message Server.
21115 Archive not up-to-date, last message archived %1, last error %2 (%3).
21116 Archive not up-to-date, last message archived %1, archiving stopped by operator.
21117 No new messages found to be archived since %1.
21118 User %1 profile not loaded - error %2.
21119 Message too big, not archived: Folder: %1",  File:"%2", Size:%3, Date:%4, From:"%5 (%6)", To:"%7 (%8)", Subject: "%9"."
21120 Linked attachment too big, not archived: Folder:  %1", File: "%2", Size: %3."
21121 Please put a blank CD into the Archive server's CD writer.
21122 Please put blank CDs into jukebox (current number of blank CDs in jukebox: %1)
21123 Error %1 (%2) occurred preparing enrypted copy of volume %3 on path %4.
21124 Error %1 (%2) occurred writing CD of volume %3
21125 Error %1 (%2) occurred verifying CD of volume %3 on path %4
21300 Hardware not supported (no TC9x detected).
21301 Hardware not supported (no TP80 detected).
21302 Hardware not supported (unable to read disk size, error %1).
21303 Logical drive %1 type %2 not supported.
21304 Not enough disk space on %1.
21305 Unable to access volume index on path %1.
21306 Unable to open data base file %1 of volume %2 on path %3. Volume will be skipped in archive search !
21307 Transaction rollback error %1.
21308 Create volume %1 error %2.
21309 Open volume %1 error %2.
21310 Close volume %1 error %2.
21311 Reorganize volume %1 error %2.
21312 Cyclic delete volume %1 error %2.
21313 Corrupt volume index file size %1.
21314 Corrupt volume index file header.
21315 Message too big to fit on archive volume, will skip message.
21316 TC/ARCHIVE process ends with error %1 (%2).
21317 Volume number %1 required for creation of index volume.
21318 Index volume would exceed the maximum volume size (%1 Bytes).
21319 Index volume would include more than %1 regular volumes.
21500 Process %1 failed to start.
21501 Process %1 restarts
21502 Startup of a process %1
21503 A fatal error occured during the startup of a process %1 (%2)
21504 TCSRV was not shut down last time
21505 A critical event occurs in the HW : %1
21506 The process %1 was started successfully
21507 A fatal error occured during the startup of a process %1 domain: %2 UserID: %3 LogonType: %4  (%5)
21508 restarting %1, %3 (%4. try of %5; internal state for developers =%2)
21509 TC Supervisor service started
21510 TC Supervisor service stopped
21511 Failed to register a function to handle tcsrv's service control requests (%1)
21512 Create DoneEvent failed (%1)
21513 Can't open TCRPC channel (%1)
21514 Can't create main thread (%1)
21515 %1-thread exception %2 at %3 occurred
21516 Unable to switch priority (%1)
21517 Unable to create CmdEvent (%1)
21518 EnableLoader is not supported!
21519 Create process %1 failed (%2)
21520 TCSRV-runloader: Killing TOS server
21521 Unable to allocate memory (%1)
21522 Unable to create an event for process %1 (%2)
21523 Unable to start worker thread for %1 (%2)
21524 Stopping process %1 timed out
21525 Terminating worker thread and process %1
21526 Terminating thread for %1
21527 Process %1 stopped (status=%2 %3)
21528 Unable to log on user %1/%2, type %3 for %4 (%5)
21529 Security identification number deleted by user %1 from computer %2
21530 Security identification number set by user %1 from computer %2
21531 Unable to reset TC9X watchdog.
21532 Watchdog timeout too short (timeout=%1 sec, overtime=%2 ms)!
21533 Installer process terminated with %1
21534 Shutdown of the service control manager
21535 Process %1 is still running.
21536 CoInitializeEx failed. hres=%1. NLB control feature will be disabled!
21537 CoInitializeSecurity failed. hres=%1. NLB control feature will be disabled!
21538 Create terminate-event failed (%1)
21539 Can't create NLB control thread (%1)
21540 Exception occurred in the function %1!
21541 Synchronizing NLB port status (port=%1) failed. Reason: (%2) %3
22001 LNK_Version (vRequested=%1 , vActual=%2).
22002 Error: Line=%3 [%1]%n function = [%2]%n %4%n GetLastError()=[%5]
22003 Warning: Line=%3 [%1]%n function = [%2]%n %4%n GetLastError()=[%5]
22004 Caught unexpected exception: Line=%3 [%1]%n function = [%2]%n %4%n GetLastError()=[%5]
22005 LNK_Enable (.,linkname=%1): TClgw is already enabled.
22006 TCLGW::create (linkname=%1): invalid configuration (%2).
22007 TClgw currently not enabled (function=%1)
22008 Internal: %1 HNDLCLASS objects still open.
22009 Internal: TClgw does not implement LNK_PrintObject.
22010 LNK_SetLinkType: unexpected linktype (%1, expected is %2).
22011 Task %1:  conclusion=%2 , state=%3.
22012 Task %1:  conclusion=%2 , state=%3.
22013 Task %1:  failed; state=%3.
22014 %1: starting.
22020 this=22020 + info , called = 22020+%1
22030 API directory %1 not accessible (%2).
22031 Dirsync from NDS tree %1 failed.
22032 Configuration error: %1.
22033 System Resources Failure %1 (%2).
22034 Internal Error %1 in file %2, Context %3, Line %4 (sysErrMsg=%5).
22035 Could not process message from Groupwise (%1); will move it to the GWPROB directory.
22036 Possible incorrect recognition of multiple line address starting in line %1: [FUA=%2]
22500 Unable to load OCR Engine
22501 Unable to load TCVIEW32.OCX
22502 TCOCR is not initialized
22503 Unable to create temporary file
22504 Error TCSI function %1 returned %2 (%3)
22505 OCR Engine reported an error %1 (%2)
22506 OCR Engine inactive for more than %1 minutes. TCDC will be restarted
22507 An exception occurred during OCR
23500 TCLANPRT has been stopped by TCSRV or with Ctrl-Break.
23501 TCLANPRT has been stopped with error code %1 (%2)
23502 TCLANPRT version %1 started
24000 TCFILBRK has been stopped by TCSRV or with Ctrl-Break.
24001 TCFILBRK has been stopped with error %1 (%2)
24002 TCFILBRK version %1 started
24500 Queue Manager %1 not accessible (%2)
24501 Invalid Queue Manager property: %1= %2
24502 Queue %1 not accessable (%2)
24503 Invalid Queue property: %1= %2
24504 Property %1 of %2 may result in %3
24505 TC/LINK-MQ out of resources
24506 Failed to create mail dependencies (%1)
24507 Queue %1 is full
25000 TC/STATUS version %1 started
25001 TC/STATUS has been stopped by %1
25500 Missing registry key %1.
25501 Memory allocation failed.
25502 An exception occurred.
25503 Database record could not be locked
25504 Login to TCOSS failed
25505 The configured TCOSS user does not exist.
25506 Wrong TCOSS password.
25507 Login to database failed (wrong userid or password)
25508 No connection to TCOSS instance %1 (%2)
25509 Connected to TCOSS instance %1
25510 Error connecting to TCSRV
25511 Probe successfully sent: Server = %1, Probe = %2 (%3)
25512 Probe failed: Server = %1, Probe = %2 (%3)
25513 Error creating stop event.
25514 Looking for not existing probe.
25515 Error sending alert message: recipient = %1, probe = %2, server = %3, error = %4
25516 No connection to SQL database
25517 Current time is not within calendar of this probe definition
25518 Invalid calendar information in probe definition %1 (server %2)
25519 TCProbe (%1) started
25520 TCProbe (%1) stopped
25521 Connection to database lost. Entering idle mode.
25522 Connection to database available again. Leaving idle mode.
27000 Fatal error occured
27001 Error in a Voice Mail helper function
27002 Incorrect number of parameters
27003 Invalid function argument passed
27004 Default error code, when a error handler (preprocesserror) was invoked
27005 The passed valued from the TC/STM was incorrect.
27006 A registry value is wrong
27007 Error in comunication with TC/STM
27008 Called ID is empty or not numeric or user can not be found
27009 Caller ID is empty or not numeric
27010 System User or pwd wrong
27011 Login to SPI failed
27012 A necessary variable is not initialized
27013 The format of an address was unknown
27014 Send message failed
27015 BCC recipient not existing
27016 Application class initialisation failed
27017 User tried to login but failed.
27018 General Error
28000 TTS Conversion failed. Error: %1
29000 Could not log on to server %1 as %2
29001 Length of time specifier in MetaMail URL not right %1
29002 PreProcess called without being initialized! Exiting.
29003 Got invalid pointer to info structure. Already initialized?
29004 MetaMail init failed, disabling it.
29004 PreProcess init failed. One or more files missing or not enough memory.
29005 MetaMail URL %1 not resolved, warning or info trace shows details.
29200 H.323 Engine registered on local interface %1 with Gatekeeper %2 in %3-discovery mode,  registration type is %4
29201 H.323 Engine not registered on local interface %1 with the Gatekeeper %2 in auto-discovery mode (), Reason: %3
29202 H.323 Engine not registered on local interface %1 with the Gatekeeper %2 in manual-discovery mode, (GkHost=%3, Gk H323_ID=%4), Reason: %5
29203 H.323 Engine started in the %1 integration mode
29204 H.323 engine stopped
29205 H.323 engine restarted due to cleanup deadlock
29300 The poller could not be created or initialized.
29301 The specified dll is invalid.
29302 Some required resources could not be created.
29303 A required handle was NULL (%1)
29304 The thread did not stop for some reason.
29305 The response could not be processed.
29306 The channel could not be registered.
29307 The TC/VLink2  received an event in the wrong state.
29308 The TC/VoiceLink2 recieved an unknown error (%1).
29309 Unable to load the configuration.
29310 TCVLAgent : Plugin %1 already loaded
29311 TCVLAgent : Failed to load library %1
29312 TCVLAgent : Failed to create an instance of plugin %1
29313 The XML-Parser has thrown an exception (%1)
29314 There was a problem with a file: %1
29315 There was a problem with a directory: %1
29316 Insufficient number of regular expresion matches (%1)
29317 TCVLAgent : The initialization of the plugin %1 failed
29318 TCVLAgent was not initialized properly.
29319 TCVLAgent : Failed to read registry value %1
29320 Function call failed: %1
29321 There was a general TCSI Error: %1
29322 There was an error during xml interpretation: %1
29323 TCVLAgent : Plugin %1 not loaded.
29324 TCVLATransform: The configured TCSI property is invalid: %1
29325 An exception was caught: %1
29326 Invalid TCSI message type %1
29327 There was an error while processing the recipients: %1
29328 The template requires a property which is missing in the message: %1
29329 There was a problem with TCRT: %1
29330 The XML parser could not be intialized: %1
29331 Error during VL2 cleanup: %1
29332 TCSIPOLLER:STL Exception occurred:
29333 TCSIPOLLER:No connection to TCOSS server
29334 TCSIPOLLER:The configuration is not initialized (null pointer)
29335 TCSIPOLLER:Function call failed: %1
30000 Starting Process %1 (plugins %2)
30001 Ending Process %1
30010 Resource Problem
30011 Supervisor thread locked; Restart requested
30012 Worker Thread Problem detected; restart issued
30013 COM Init failed.
30014 Error in plugin %1 (Code %2)
30015 Invalid operating system detected.
30016 System Exception in %1 (%2).
30017 Problem with TCRT (%1 - %2).
30018 Missing account permissions to launch and access COM objects (%1).
30019 Error while accessing TCOSS %1 (%2)
30020 No valid license available for %1
31501 ERROR: %1
31502 WARNING: %1
31503 INFORMATION: %1
31504 ERROR: %1
31505 WARNING: %1
31506 INFORMATION: %1
32000 Unknown Recipient %1!
32001 Cant Send Message
32002 Can't find Userfile %1
32003 Can't find Calender file %1
32004 Can't Logon
32005 Wrong Userfile
32006 Wrong Calendar file
32007 Not enough rights for user %1
32008 Unknown Date or Time Entry %1
32009 0,01
32700 You have a temporary VoIP-CAPI license that will expire on %3
32701 You are using %3 Fax over IP channels, but your VoIP-CAPI license includes only %4 channels
32750 TCReleaseAgent Error %1
32751 TCReleaseAgent Warning: %1
32752 TCReleaseAgent Information: %1
35000 Info: %4 (Internal location: %1)
35001 Warning: %4 (internal location: %1)
35002 Error: %4 (internal location: %1)
35003 Application version '%4' has been started
35004 Startup of application version '%4' failed with errors. Some features may not be available.
35005 Startup of Component '%1' failed with error '%5'. (details: code=%6, category=%7)
35006 Component '%1' failed with error '%5'. (code=%6, category=%7, process id=%8)
35010 Green alert '%4' in feature '%2' of component '%1' (internal location: %3)
35011 Gray alert '%4' in feature '%2' of component '%1' (internal location: %3)
35012 Yellow  alert '%4' in feature '%2' of component '%1' (internal location: %3)
35013 Red alert '%4' in feature '%2' of component '%1' (internal location: %3)
35014 Black alert '%4' in feature '%2' of component '%1' (internal location: %3)
35020 Login of component '%1' to server %4 with user %5 failed. Error code: %7
35021 Successful login of component '%1' to server %4
35022 Cannot start service %1  %2
35023 Reception has been stopped because storage usage (%4: %5% percent) reached %6 percent.
35024 Disk usage (%4: %5% percent) reached %6 percent. Reception will be stopped if the usage reaches %7 percent.
35025 Disk usage (%4: %5% percent) has decreased below %6 percent.
36100 Failed to set DcomConfig. Error code: %4;
36101 KCIC-AEF Message Connector not set to productive mode - document conversion with MS Office will fail if no user logged in.
36102 Document conversion failed. Error code: %4; Document: %5;
37000 Message (id=%4) from %5 has been rejected by KC with error %6. The message has been deleted from the active" folder, but will be visible in the MC history for some time."
37001 Message (id=%4) from %5 has been rejected by KC with error %6. The message is kept in the active - failed" folder and has to be handled manually."
37002 Message (id=%4) from %5 has been rejected by KC with error %6. The message will be forwarded to %7.
37003 Forwarding of message (id=%4) from %5 to %6 failed with error %7. The message has been deleted from the active" folder, but will be visible in the MC history for some time."
37004 Forwarding of message (id=%4) from %5 to %6 failed with error %7. The message is kept in the active - failed" folder and has to be handled manually."
37005 Starting SMTP listener is not possible: %4;
37006 Windows Network Load Balancing disabled, control thread terminating; Reason: %4
37007 Windows Network Load Balancing disabled, control thread terminating; Reason: %4
37008 Windows Network Load Balancing enabled.
37009 Windows Network Load Balancing port rule is missing; Configured ports: %4, NLB port rules: %5; Port rule missing for port: %6; 
37010 Windows Network Load Balancing control error; Reason: %4
38000 Unspecified warning in KCIC-AEF KC Plug-In. Details %1 %2 %3 %4 %5 %6
38001 Could not start KCIC AEF KC Plug-in
38002 Sending batch to QC due to document conversion error
38003 The KCIC AEF KC Plug-in license will expire soon
38004 A system error occured, that caused the connection to stop
38005 A system error occured, that caused the connection to stop, but a recovery has been scheduled
38006 The attempt to recover from a system error failed
38007 The attempt to recover from a system error succeded
38008 Could not initialize license
38009 Process documents as independent batches is turned on. With this setting only batch size 1 is supported. Setting batch size to 1
38010 Could not load configuration
39000 KCSBACKUP license error. %1
39001 KCSBACKUP started successfully
39002 KCSBACKUP was stopped
39003 Backup failed.Error: %1
39004 Backup of %1 completed.
39099 Error: %1

Keywords: Error Codes, Events, Eventlog, Event-log, EventID, Event-ID, event id,TCSI